{"text_format":"1","workbook":"xlsx","n_sheets":21,"sheets":["Imprint","TBP","TBP%","Roadmap","Tabelle1","ProjectList","TeamList","CapacityData","PRJ_Test #1","PRJ_Test #2","PRJ_Test #3","PRJ_Test #4","PRJ_Test #5","PRJ_Test #6","PRJ_Template","Raw","Import","AnonymousLookup","CapacityModel","Backlog","Colorindex"],"not_rendered":{"charts":5,"images":3,"macros":1,"external_links":2,"defined_names":14,"comments":0,"pivot_tables":0},"unopened":[],"bounds":{"document_bytes":16777216,"sheet_cells":100000,"rows_first":2000,"rows_last":500,"rows_between":2000,"halvings":0,"cell_chars":16384,"cell_head_chars":4096},"cells_cut":0,"cells_raw":0,"read":"whole","date_system":"1900"}

{"sheet":"Imprint","index":0,"n_rows":74,"n_cols":10,"rows_kept":74,"cut":false,"hidden":false,"merged":[]}
[]
[null,"SmartPipeliner",null,null,"Version 3.0.0"]
[]
[null,"Simple and fast Tool to Control the Work-In-Progress of a Multi-Project-Organization"]
[]
[null,"Tutorials: ","Basic Introduction in how to use the SmartPipeliner and how to do the first Staggering",null,null,null,null,null,null,"<<<<< klick here to watch on youtube"]
[null,null,"Advanced feature \"the capacity model\"",null,null,null,null,null,null,"<<<<< klick here to watch on youtube"]
[null,null,"Advanced feature \"mass import of projects\"",null,null,null,null,null,null,"<<<<< klick here to watch on youtube"]
{"$rows_left_out":67}
{"sheet":"TBP","index":1,"n_rows":2009,"n_cols":27,"rows_kept":2009,"cut":false,"hidden":false,"merged":[]}
["Team Balancing Plan"]
[{"$f":"\"Version: \"&TEXT(TODAY(),\"JJJJ-MM-TT\")","v":"Version: 2023-03-12"}]
[]
["T_QA","Quality Assurance (Michael Meier)",{"$f":"TEXT(2023,\"0000\")&\"-\"&TEXT(1,\"00\")","v":"2023-01"},{"$f":"TEXT(2023,\"0000\")&\"-\"&TEXT(2,\"00\")","v":"2023-02"},{"$f":"TEXT(2023,\"0000\")&\"-\"&TEXT(3,\"00\")","v":"2023-03"},{"$f":"TEXT(2023,\"0000\")&\"-\"&TEXT(4,\"00\")","v":"2023-04"},{"$f":"TEXT(2023,\"0000\")&\"-\"&TEXT(5,\"00\")","v":"2023-05"},{"$f":"TEXT(2023,\"0000\")&\"-\"&TEXT(6,\"00\")","v":"2023-06"},{"$f":"TEXT(2023,\"0000\")&\"-\"&TEXT(7,\"00\")","v":"2023-07"},{"$f":"TEXT(2023,\"0000\")&\"-\"&TEXT(8,\"00\")","v":"2023-08"},{"$f":"TEXT(2023,\"0000\")&\"-\"&TEXT(9,\"00\")","v":"2023-09"},{"$f":"TEXT(2023,\"0000\")&\"-\"&TEXT(10,\"00\")","v":"2023-10"},{"$f":"TEXT(2023,\"0000\")&\"-\"&TEXT(11,\"00\")","v":"2023-11"},{"$f":"TEXT(2023,\"0000\")&\"-\"&TEXT(12,\"00\")","v":"2023-12"},{"$f":"TEXT(2024,\"0000\")&\"-\"&TEXT(1,\"00\")","v":"2024-01"},{"$f":"TEXT(2024,\"0000\")&\"-\"&TEXT(2,\"00\")","v":"2024-02"},{"$f":"TEXT(2024,\"0000\")&\"-\"&TEXT(3,\"00\")","v":"2024-03"},{"$f":"TEXT(2024,\"0000\")&\"-\"&TEXT(4,\"00\")","v":"2024-04"},{"$f":"TEXT(2024,\"0000\")&\"-\"&TEXT(5,\"00\")","v":"2024-05"},{"$f":"TEXT(2024,\"0000\")&\"-\"&TEXT(6,\"00\")","v":"2024-06"}]
[null,"Testprojekt #1 (PRJ_Test #1)",null,8,10,9,2]
[null,"Testprojekt #2 (PRJ_Test #2)",null,null,5,5,10,10,20,5]
[null,"Testprojekt #3 (PRJ_Test #3)",null,null,null,null,null,null,null,5,10,5]
[null,"Testprojekt #4 (PRJ_Test #4)",null,null,null,null,null,null,null,null,null,8,10,9,2]
{"$rows_left_out":2002}
{"sheet":"TBP%","index":2,"n_rows":2014,"n_cols":27,"rows_kept":2014,"cut":false,"hidden":false,"merged":[]}
["Team Balancing Plan"]
[{"$f":"\"Version: \"&TEXT(TODAY(),\"JJJJ-MM-TT\")","v":"Version: 2023-03-12"}]
[]
["T_QA","Quality Assurance (Michael Meier)",{"$f":"TEXT(2023,\"0000\")&\"-\"&TEXT(1,\"00\")","v":"2023-01"},{"$f":"TEXT(2023,\"0000\")&\"-\"&TEXT(2,\"00\")","v":"2023-02"},{"$f":"TEXT(2023,\"0000\")&\"-\"&TEXT(3,\"00\")","v":"2023-03"},{"$f":"TEXT(2023,\"0000\")&\"-\"&TEXT(4,\"00\")","v":"2023-04"},{"$f":"TEXT(2023,\"0000\")&\"-\"&TEXT(5,\"00\")","v":"2023-05"},{"$f":"TEXT(2023,\"0000\")&\"-\"&TEXT(6,\"00\")","v":"2023-06"},{"$f":"TEXT(2023,\"0000\")&\"-\"&TEXT(7,\"00\")","v":"2023-07"},{"$f":"TEXT(2023,\"0000\")&\"-\"&TEXT(8,\"00\")","v":"2023-08"},{"$f":"TEXT(2023,\"0000\")&\"-\"&TEXT(9,\"00\")","v":"2023-09"},{"$f":"TEXT(2023,\"0000\")&\"-\"&TEXT(10,\"00\")","v":"2023-10"},{"$f":"TEXT(2023,\"0000\")&\"-\"&TEXT(11,\"00\")","v":"2023-11"},{"$f":"TEXT(2023,\"0000\")&\"-\"&TEXT(12,\"00\")","v":"2023-12"},{"$f":"TEXT(2024,\"0000\")&\"-\"&TEXT(1,\"00\")","v":"2024-01"},{"$f":"TEXT(2024,\"0000\")&\"-\"&TEXT(2,\"00\")","v":"2024-02"},{"$f":"TEXT(2024,\"0000\")&\"-\"&TEXT(3,\"00\")","v":"2024-03"},{"$f":"TEXT(2024,\"0000\")&\"-\"&TEXT(4,\"00\")","v":"2024-04"},{"$f":"TEXT(2024,\"0000\")&\"-\"&TEXT(5,\"00\")","v":"2024-05"},{"$f":"TEXT(2024,\"0000\")&\"-\"&TEXT(6,\"00\")","v":"2024-06"}]
[null,"Testprojekt #1 (PRJ_Test #1)",null,0.54437384709981562,0.62757195811902322,0.68701026376779606,0.13873605326572969]
[null,"Testprojekt #2 (PRJ_Test #2)",null,null,0.31378597905951161,0.38167236875988669,0.69368026632864843,0.6873407160351207,1.3212957453879022,0.32699802028307007]
[null,"Testprojekt #3 (PRJ_Test #3)",null,null,null,null,null,null,null,0.32699802028307007,0.71628137776291534,0.33356240631116152]
[null,"Testprojekt #4 (PRJ_Test #4)",null,null,null,null,null,null,null,null,null,0.53369985009785836,0.65429548930266301,0.76054595728758978,0.12838316492633314]
{"$rows_left_out":2007}
{"sheet":"Roadmap","index":3,"n_rows":10,"n_cols":22,"rows_kept":10,"cut":false,"hidden":false,"merged":[]}
["Roadmap"]
[{"$f":"\"Version: \"&TEXT(TODAY(),\"JJJJ-MM-TT\")","v":"Version: 2023-03-12"}]
[null,null,"Constraint Entry/Exit Month"]
["PrjID","Project","EntryOffset","ExitOffset",{"$f":"TEXT(2023,\"0000\")&\"-\"&TEXT(1,\"00\")","v":"2023-01"},{"$f":"TEXT(2023,\"0000\")&\"-\"&TEXT(2,\"00\")","v":"2023-02"},{"$f":"TEXT(2023,\"0000\")&\"-\"&TEXT(3,\"00\")","v":"2023-03"},{"$f":"TEXT(2023,\"0000\")&\"-\"&TEXT(4,\"00\")","v":"2023-04"},{"$f":"TEXT(2023,\"0000\")&\"-\"&TEXT(5,\"00\")","v":"2023-05"},{"$f":"TEXT(2023,\"0000\")&\"-\"&TEXT(6,\"00\")","v":"2023-06"},{"$f":"TEXT(2023,\"0000\")&\"-\"&TEXT(7,\"00\")","v":"2023-07"},{"$f":"TEXT(2023,\"0000\")&\"-\"&TEXT(8,\"00\")","v":"2023-08"},{"$f":"TEXT(2023,\"0000\")&\"-\"&TEXT(9,\"00\")","v":"2023-09"},{"$f":"TEXT(2023,\"0000\")&\"-\"&TEXT(10,\"00\")","v":"2023-10"},{"$f":"TEXT(2023,\"0000\")&\"-\"&TEXT(11,\"00\")","v":"2023-11"},{"$f":"TEXT(2023,\"0000\")&\"-\"&TEXT(12,\"00\")","v":"2023-12"},{"$f":"TEXT(2024,\"0000\")&\"-\"&TEXT(1,\"00\")","v":"2024-01"},{"$f":"TEXT(2024,\"0000\")&\"-\"&TEXT(2,\"00\")","v":"2024-02"},{"$f":"TEXT(2024,\"0000\")&\"-\"&TEXT(3,\"00\")","v":"2024-03"},{"$f":"TEXT(2024,\"0000\")&\"-\"&TEXT(4,\"00\")","v":"2024-04"},{"$f":"TEXT(2024,\"0000\")&\"-\"&TEXT(5,\"00\")","v":"2024-05"},{"$f":"TEXT(2024,\"0000\")&\"-\"&TEXT(6,\"00\")","v":"2024-06"}]
["PRJ_Test #1","Testprojekt #1",1,1,22,36,30,19,4]
["PRJ_Test #2","Testprojekt #2",3,4,null,25,25,37,41,42,42,10]
["PRJ_Test #3","Testprojekt #3",8,8,null,null,null,null,null,null,null,20,23,17]
["PRJ_Test #4","Testprojekt #4",null,null,null,null,null,null,null,null,null,null,22,35,30,19,4]
{"$rows_left_out":3}
{"sheet":"Tabelle1","index":4,"n_rows":25,"n_cols":11,"rows_kept":25,"cut":false,"hidden":false,"merged":[]}
[]
[]
[]
["Project: Description","Project: Priority","Project: Project end date (End)","Task: Task type","Task: Description","Task: Predecessor(s)","Task: Fill color","Task: Duration (d)","Skill: Description","Resource assignment: Units","Resource assignment: Duration (d)"]
["PRJ_Andro Lion HS SL930 Projekt_025",50,null,"Stage","Lead",null,"RGB(9F,C6,E1)",61]
["PRJ_Andro Lion HS SL930 Projekt_025",null,null,"VirtualDrum","Critical","Lead","Yellow",81,"ST_WRO",2,81]
["PRJ_Andro Lion HS SL930 Projekt_025",null,null,"Stage","Lag","Critical","RGB(92,D0,50)",8]
["PRJ_BoSuLiTu&Co BS Projekt_022",50,null,"Stage","Lead",null,"RGB(9F,C6,E1)",43]
{"$rows_left_out":18}
{"sheet":"ProjectList","index":5,"n_rows":14,"n_cols":20,"rows_kept":14,"cut":false,"hidden":false,"merged":[]}
["Project List",null,null,null,null,null,null,null,null,null,null,null,null,"Version/Today"]
[null,null,null,null,null,null,null,null,null,null,null,null,null,"2023-02-21",{"$f":"IF(today<TODAY(),\"maybe this report is outdated - if you want to generate a up-to-date report change date to the current date\",\"\")","v":"maybe this report is outdated - if you want to generate a up-to-date report change date to the current date"}]
["TBP-Start-Year",2023]
["TBP-Start-Month",1]
["TBP-Duration",18]
["TBP-Active-Level",1,"Active-Level of project has to be higher or equal",null,null,null,null,null,null,null,null,null,null,"execution management"]
[null,null,null,null,null,null,null,null,"resulting project delimiter",null,null,null,null,"status",null,null,"hint",null,"action"]
["Project-ID (Sheet)","Project","Start-Year","Start-Month","Active-Level","Col","GoTo",null,"Start","Enter-Constr.","Exit-Constr.","End",null,"Date of Status","Project Phase","Remaining Working \nDays in Phase","Pay Attention",null,"Phase Overrun in \nCalendar Days","Meassures to regain overspent time …"]
{"$rows_left_out":7}
{"sheet":"TeamList","index":6,"n_rows":5,"n_cols":29,"rows_kept":5,"cut":false,"hidden":false,"merged":[]}
["Team-ID","Team","Team-Lead","SkillClass","average load","aggregated load",null,"Line","Notes","Project  Quota","2023-01",{"$f":"IF(RIGHT(K1,2)=\"12\",TEXT(VALUE(LEFT(K1,4))+1,\"0\")&\"-01\",LEFT(K1,4)&\"-\"&TEXT(VALUE(RIGHT(K1,2))+1,\"00\"))","v":"2023-02"},{"$f":"IF(RIGHT(L1,2)=\"12\",TEXT(VALUE(LEFT(L1,4))+1,\"0\")&\"-01\",LEFT(L1,4)&\"-\"&TEXT(VALUE(RIGHT(L1,2))+1,\"00\"))","v":"2023-03"},"2023-04","2023-05","2023-06","2023-07","2023-08","2023-09","2023-10","2023-11","2023-12","2024-01","2024-02","2024-03","2024-04","2024-05","2024-06","2024-07"]
["T_QA","Quality Assurance","Michael Meier","Quality",0.78263472863498462,0,null,{"$f":"ROW(A2)","v":2},null,0.85,1,{"$f":"K2","v":1},1,1,1,1,1,1,1,1,1,1,1,1,1,1,1,1,1]
["T_DEV","Development","Hans Huber","Development",0.56295174424242467,0,null,{"$f":"ROW(A3)","v":3},null,0.75,3.5,{"$f":"K3","v":3.5},{"$f":"L3","v":3.5},{"$f":"M3","v":3.5},{"$f":"N3","v":3.5},{"$f":"O3","v":3.5},{"$f":"P3","v":3.5},{"$f":"Q3","v":3.5},{"$f":"R3","v":3.5},{"$f":"S3","v":3.5},{"$f":"T3","v":3.5},{"$f":"U3","v":3.5},{"$f":"V3","v":3.5},{"$f":"W3","v":3.5},{"$f":"X3","v":3.5},{"$f":"Y3","v":3.5},{"$f":"Z3","v":3.5},{"$f":"AA3","v":3.5},{"$f":"AB3","v":3.5}]
["T_PM","Product Management","Franz Weber","ProductManagement",0.37211955105422717,0,null,{"$f":"ROW(A4)","v":4},null,1,1,{"$f":"K4","v":1},1,1,1,1,1,1,1,1,1,1,1,1,1,1,1,1,1]
["* VirtualDrum","Virtual Team for Concept & Integration","Super Man","VirtualDrum",0.33333333333333331,0,null,5,null,1,2,{"$f":"K5","v":2},{"$f":"L5","v":2},2,2,2,2,2,2,{"$f":"S5","v":2},2,2,2,2,2,2,2,2,2]

{"sheet":"CapacityData","index":7,"n_rows":73,"n_cols":12,"rows_kept":73,"cut":false,"hidden":false,"merged":[]}
["Team-ID","Year","Month","Capacity",null,"Sort Order (Line)","Working Days per Month","Project Quota for Team","Offset in FTE-Table in Teamlist","FTE for Team for Month",null,"ListOfAll SkillClasses"]
["T_PM",{"$f":"VALUE(LEFT(TeamList!K1,4))","v":2023},{"$f":"VALUE(RIGHT(TeamList!K1,2))","v":1},{"$f":"G2*H2*J2","v":17.634939759036143},null,{"$f":"VLOOKUP(A2,TeamList!A:I,8,FALSE)","v":4},{"$f":"VLOOKUP(B2&\"-\"&TEXT(C2,\"00\"),CapacityModel!A:G,7,FALSE)","v":17.634939759036143},{"$f":"VLOOKUP(A2,TeamList!A:K,10,FALSE)","v":1},{"$f":"(B2*12+C2-1)-(VALUE(LEFT(TeamList!$K$1,4))*12+VALUE(RIGHT(TeamList!$K$1,2))-1)","v":0},{"$f":"INDEX(TeamList!A:BY,VLOOKUP(A2,TeamList!A:K,8,FALSE),11+I2)","v":1},null,"C-Level/CxO"]
["T_PM",{"$f":"IF(C2=12,B2+1,B2)","v":2023},{"$f":"IF(C2=12,1,C2+1)","v":2},{"$f":"G3*H3*J3","v":17.289156626506021},null,{"$f":"VLOOKUP(A3,TeamList!A:I,8,FALSE)","v":4},{"$f":"VLOOKUP(B3&\"-\"&TEXT(C3,\"00\"),CapacityModel!A:G,7,FALSE)","v":17.289156626506021},{"$f":"VLOOKUP(A3,TeamList!A:K,10,FALSE)","v":1},{"$f":"(B3*12+C3-1)-(VALUE(LEFT(TeamList!$K$1,4))*12+VALUE(RIGHT(TeamList!$K$1,2))-1)","v":1},{"$f":"INDEX(TeamList!A:BY,VLOOKUP(A3,TeamList!A:K,8,FALSE),11+I3)","v":1},null,"Marketing"]
["T_PM",{"$f":"IF(C3=12,B3+1,B3)","v":2023},{"$f":"IF(C3=12,1,C3+1)","v":3},18.746385542168674,null,{"$f":"VLOOKUP(A4,TeamList!A:I,8,FALSE)","v":4},{"$f":"VLOOKUP(B4&\"-\"&TEXT(C4,\"00\"),CapacityModel!A:G,7,FALSE)","v":18.746385542168674},{"$f":"VLOOKUP(A4,TeamList!A:K,10,FALSE)","v":1},{"$f":"(B4*12+C4-1)-(VALUE(LEFT(TeamList!$K$1,4))*12+VALUE(RIGHT(TeamList!$K$1,2))-1)","v":2},{"$f":"INDEX(TeamList!A:BY,VLOOKUP(A4,TeamList!A:K,8,FALSE),11+I4)","v":1},null,"Sales"]
["T_PM",2023,4,15.412048192771085,null,{"$f":"VLOOKUP(A5,TeamList!A:I,8,FALSE)","v":4},{"$f":"VLOOKUP(B5&\"-\"&TEXT(C5,\"00\"),CapacityModel!A:G,7,FALSE)","v":15.412048192771085},{"$f":"VLOOKUP(A5,TeamList!A:K,10,FALSE)","v":1},{"$f":"(B5*12+C5-1)-(VALUE(LEFT(TeamList!$K$1,4))*12+VALUE(RIGHT(TeamList!$K$1,2))-1)","v":3},{"$f":"INDEX(TeamList!A:BY,VLOOKUP(A5,TeamList!A:K,8,FALSE),11+I5)","v":1},null,"FunctionalDepartment"]
["T_PM",2023,5,16.959839357429718,null,{"$f":"VLOOKUP(A6,TeamList!A:I,8,FALSE)","v":4},{"$f":"VLOOKUP(B6&\"-\"&TEXT(C6,\"00\"),CapacityModel!A:G,7,FALSE)","v":16.959839357429718},{"$f":"VLOOKUP(A6,TeamList!A:K,10,FALSE)","v":1},{"$f":"(B6*12+C6-1)-(VALUE(LEFT(TeamList!$K$1,4))*12+VALUE(RIGHT(TeamList!$K$1,2))-1)","v":4},{"$f":"INDEX(TeamList!A:BY,VLOOKUP(A6,TeamList!A:K,8,FALSE),11+I6)","v":1},null,"ProductManagement"]
["T_PM",2023,6,17.116265060240963,null,{"$f":"VLOOKUP(A7,TeamList!A:I,8,FALSE)","v":4},{"$f":"VLOOKUP(B7&\"-\"&TEXT(C7,\"00\"),CapacityModel!A:G,7,FALSE)","v":17.116265060240963},{"$f":"VLOOKUP(A7,TeamList!A:K,10,FALSE)","v":1},{"$f":"(B7*12+C7-1)-(VALUE(LEFT(TeamList!$K$1,4))*12+VALUE(RIGHT(TeamList!$K$1,2))-1)","v":5},{"$f":"INDEX(TeamList!A:BY,VLOOKUP(A7,TeamList!A:K,8,FALSE),11+I7)","v":1},null,"ProjectManagement"]
["T_PM",2023,7,17.807831325301201,null,{"$f":"VLOOKUP(A8,TeamList!A:I,8,FALSE)","v":4},{"$f":"VLOOKUP(B8&\"-\"&TEXT(C8,\"00\"),CapacityModel!A:G,7,FALSE)","v":17.807831325301201},{"$f":"VLOOKUP(A8,TeamList!A:K,10,FALSE)","v":1},{"$f":"(B8*12+C8-1)-(VALUE(LEFT(TeamList!$K$1,4))*12+VALUE(RIGHT(TeamList!$K$1,2))-1)","v":6},{"$f":"INDEX(TeamList!A:BY,VLOOKUP(A8,TeamList!A:K,8,FALSE),11+I8)","v":1},null,"Development"]
{"$rows_left_out":66}
{"sheet":"PRJ_Test #1","index":8,"n_rows":28,"n_cols":16,"rows_kept":28,"cut":false,"hidden":false,"merged":[]}
["Project-ID","PRJ_Test #1"]
["Project ",{"$f":"VLOOKUP(B1,ProjectList!A:E,2,FALSE)","v":"Testprojekt #1"}]
["Start-Year",{"$f":"VLOOKUP(B1,ProjectList!A:E,3,FALSE)","v":2023}]
["Start-Month",{"$f":"VLOOKUP(B1,ProjectList!A:E,4,FALSE)","v":1}]
["Active",{"$f":"VLOOKUP(B1,ProjectList!A:E,5,FALSE)","v":2}]
[]
["Load per Month"]
["Offset to Start",null,0,1,2,3,4,5,6,7,8,9,10,11,12,13]
{"$rows_left_out":21}
{"sheet":"PRJ_Test #2","index":9,"n_rows":28,"n_cols":16,"rows_kept":28,"cut":false,"hidden":false,"merged":[]}
["Project-ID","PRJ_Test #2"]
["Project ",{"$f":"VLOOKUP(B1,ProjectList!A:E,2,FALSE)","v":"Testprojekt #2"}]
["Start-Year",{"$f":"VLOOKUP(B1,ProjectList!A:E,3,FALSE)","v":2023}]
["Start-Month",{"$f":"VLOOKUP(B1,ProjectList!A:E,4,FALSE)","v":2}]
["Active",{"$f":"VLOOKUP(B1,ProjectList!A:E,5,FALSE)","v":2}]
[]
["Load per Month"]
["Offset to Start",null,0,1,2,3,4,5,6,7,8,9,10,11,12,13]
{"$rows_left_out":21}
{"sheet":"PRJ_Test #3","index":10,"n_rows":28,"n_cols":16,"rows_kept":28,"cut":false,"hidden":false,"merged":[]}
["Project-ID","PRJ_Test #3"]
["Project ",{"$f":"VLOOKUP(B1,ProjectList!A:E,2,FALSE)","v":"Testprojekt #3"}]
["Start-Year",{"$f":"VLOOKUP(B1,ProjectList!A:E,3,FALSE)","v":2023}]
["Start-Month",{"$f":"VLOOKUP(B1,ProjectList!A:E,4,FALSE)","v":8}]
["Active",{"$f":"VLOOKUP(B1,ProjectList!A:E,5,FALSE)","v":2}]
[]
["Load per Month"]
["Offset to Start",null,0,1,2,3,4,5,6,7,8,9,10,11,12,13]
{"$rows_left_out":21}
{"sheet":"PRJ_Test #4","index":11,"n_rows":28,"n_cols":16,"rows_kept":28,"cut":false,"hidden":false,"merged":[]}
["Project-ID","PRJ_Test #4"]
["Project ",{"$f":"VLOOKUP(B1,ProjectList!A:E,2,FALSE)","v":"Testprojekt #4"}]
["Start-Year",{"$f":"VLOOKUP(B1,ProjectList!A:E,3,FALSE)","v":2023}]
["Start-Month",{"$f":"VLOOKUP(B1,ProjectList!A:E,4,FALSE)","v":9}]
["Active",{"$f":"VLOOKUP(B1,ProjectList!A:E,5,FALSE)","v":1}]
[]
["Load per Month"]
["Offset to Start",null,0,1,2,3,4,5,6,7,8,9,10,11,12,13]
{"$rows_left_out":21}
{"sheet":"PRJ_Test #5","index":12,"n_rows":28,"n_cols":16,"rows_kept":28,"cut":false,"hidden":false,"merged":[]}
["Project-ID","PRJ_Test #5"]
["Project ",{"$f":"VLOOKUP(B1,ProjectList!A:E,2,FALSE)","v":"Testprojekt #5"}]
["Start-Year",{"$f":"VLOOKUP(B1,ProjectList!A:E,3,FALSE)","v":2023}]
["Start-Month",{"$f":"VLOOKUP(B1,ProjectList!A:E,4,FALSE)","v":11}]
["Active",{"$f":"VLOOKUP(B1,ProjectList!A:E,5,FALSE)","v":1}]
[]
["Load per Month"]
["Offset to Start",null,0,1,2,3,4,5,6,7,8,9,10,11,12,13]
{"$rows_left_out":21}
{"sheet":"PRJ_Test #6","index":13,"n_rows":28,"n_cols":16,"rows_kept":28,"cut":false,"hidden":false,"merged":[]}
["Project-ID","PRJ_Test #6"]
["Project ",{"$f":"VLOOKUP(B1,ProjectList!A:E,2,FALSE)","v":"Testprojekt #6"}]
["Start-Year",{"$f":"VLOOKUP(B1,ProjectList!A:E,3,FALSE)","v":2023}]
["Start-Month",{"$f":"VLOOKUP(B1,ProjectList!A:E,4,FALSE)","v":16}]
["Active",{"$f":"VLOOKUP(B1,ProjectList!A:E,5,FALSE)","v":1}]
[]
["Load per Month"]
["Offset to Start",null,0,1,2,3,4,5,6,7,8,9,10,11,12,13]
{"$rows_left_out":21}
{"sheet":"PRJ_Template","index":14,"n_rows":28,"n_cols":16,"rows_kept":28,"cut":false,"hidden":false,"merged":[]}
["Project-ID","PRJ_Template"]
["Project ",{"$f":"VLOOKUP(B1,ProjectList!A:E,2,FALSE)","v":{"$error":"#N/A"}}]
["Start-Year",{"$f":"VLOOKUP(B1,ProjectList!A:E,3,FALSE)","v":{"$error":"#N/A"}}]
["Start-Month",{"$f":"VLOOKUP(B1,ProjectList!A:E,4,FALSE)","v":{"$error":"#N/A"}}]
["Active",{"$f":"VLOOKUP(B1,ProjectList!A:E,5,FALSE)","v":{"$error":"#N/A"}}]
[]
["Load per Month"]
["Offset to Start",null,0,1,2,3,4,5,6,7,8,9,10,11,12,13]
{"$rows_left_out":21}
{"sheet":"Raw","index":15,"n_rows":84,"n_cols":5,"rows_kept":84,"cut":false,"hidden":false,"merged":[]}
["Project-Id","Team-id","year","month","effort"]
["PRJ_Test #1","T_PM",2023,1,12]
["PRJ_Test #1","T_PM",2023,2,2]
["PRJ_Test #1","T_DEV",2023,1,10]
["PRJ_Test #1","T_DEV",2023,2,25]
["PRJ_Test #1","T_DEV",2023,3,20]
["PRJ_Test #1","T_DEV",2023,4,10]
["PRJ_Test #1","T_DEV",2023,5,2]
{"$rows_left_out":77}
{"sheet":"Import","index":16,"n_rows":87,"n_cols":14,"rows_kept":87,"cut":false,"hidden":false,"merged":[]}
["Message","Project-Id (without leading PRJ_)","Team-id (s. TeamList)","Month (relative to start 0 = first month)","Effort (in PersonDays)",null,"Effort on timeline …"]
["imported","Test #1","T_PM",0,12,null,"Typ1",0,1,2,3,4,5,6]
["imported","Test #1","T_PM",1,2,null,"T_ProductManagement_001",12,2]
["imported","Test #1","T_DEV",0,10,null,"T_Development_001",10,25,20,10,3]
["imported","Test #1","T_DEV",1,25,null,"T_Quality_001",null,8,12,8,5]
["imported","Test #1","T_DEV",2,20,null,"* VirtualDrum",null,1]
["imported","Test #1","T_DEV",3,10]
["imported","Test #1","T_DEV",4,2,null,"Typ2",0,1,2,3,4,5,6]
{"$rows_left_out":80}
{"sheet":"AnonymousLookup","index":17,"n_rows":11,"n_cols":3,"rows_kept":11,"cut":false,"hidden":false,"merged":[]}
["Class","AnonymousID","OriginalID"]
["Project","PRJ_001","PRJ_Test #1"]
["Project","PRJ_002","PRJ_Test #2"]
["Project","PRJ_003","PRJ_Test #3"]
["Project","PRJ_004","PRJ_Test #4"]
["Project","PRJ_005","PRJ_Test #5"]
["Project","PRJ_006","PRJ_Test #6"]
["Team","T_Quality_001","T_QA"]
{"$rows_left_out":4}
{"sheet":"CapacityModel","index":18,"n_rows":148,"n_cols":13,"rows_kept":148,"cut":false,"hidden":false,"merged":[]}
["Generic capacity model for next years (Germany)"]
[]
["working days per year after bank holidays, illness and vacation",null,null,null,null,205]
["*type of capacity model you want to use",null,null,null,null,"detailed","simple = PPY/12, detailed s. this sheet"]
[]
[{"$f":"\"calculation of brutto working days per month in \"&K6","v":"calculation of brutto working days per month in 2023"},null,null,null,null,null,null,null,"bank holidays for year",null,2023,null,{"$f":"\"overview about envelope curves for year \"&K6","v":"overview about envelope curves for year 2023"}]
["key","month","working days","resulting envelope","working days envelope","illness/vacation correction factor","mean brutto working days*",null,{"$f":"DATE(K6,1,1)","v":"2023-01-01"},"Neujahr"]
[{"$f":"K6&\"-\"&TEXT(B8,\"00\")","v":"2023-01"},1,{"$f":"NETWORKDAYS(DATE(K6,B8,1),DATE(K6,B9,1)-1,I7:I20)","v":21},{"$f":"E8*F8","v":1.032289156626506},{"$f":"C8/(SUM(C8:C19)/12)","v":1.0120481927710843},1.02,{"$f":"PPDYear/12*IF(CapaModel=\"simple\",1,D8)","v":17.634939759036143},null,{"$f":"DATE(K6,1,6)","v":"2023-01-06"},"Dreikönigstag"]
{"$rows_left_out":141}
{"sheet":"Backlog","index":19,"n_rows":52,"n_cols":5,"rows_kept":52,"cut":false,"hidden":false,"merged":[]}
["prio","missing features","requested","finished","Version"]
["A","marker for Virtual Constraint/Drum as stagining phase for EssentialFlow","2022-12-24","2023-01-01","3.0"]
["A","staggering/roadmap view with 3 phase before,in,after (bia) contstaint","2022-12-24","2023-01-01","3.0"]
["A","generating the bia-dates","2022-12-24","2023-01-01","3.0"]
["A","execution management based on bia-phase status - messages based on status & reporting date versus bia-phase-dates","2022-12-24","2023-01-03","3.0"]
["A","reporting date of status report - messages based on reporting date - reporting status","2022-12-24","2023-01-03","3.0"]
["A","remaining duration in phase - messages if phase overrun","2022-12-24","2023-01-03","3.0"]
["A","buffer regain meassures with due-date (removed in anonymous export)","2022-12-24","2023-01-03","3.0"]
{"$rows_left_out":45}
{"sheet":"Colorindex","index":20,"n_rows":58,"n_cols":3,"rows_kept":58,"cut":false,"hidden":false,"merged":[]}
["ColorIndex"]
[0]
[1,null,43]
[2,null,45]
[3]
[4]
[5]
[6]
{"$rows_left_out":50}